Target
Adenosine receptor A2a
Ligand
BDBM50025883
Substrate
Ki
>10000±n/a nM
Comments
PDSP_2595
Citation
 van Galen, PJvan Bergen, AHGallo-Rodriguez, CMelman, NOlah, MEIJzerman, APStiles, GLJacobson, KA A binding site model and structure-activity relationships for the rat A3 adenosine receptor. Mol Pharmacol 45:1101-11 (1994) Target
Name:
Adenosine receptor A2a
Synonyms:
AA2AR_RAT Adenosine A2 receptor Adenosine Receptors A2a (A2a) Adenosine receptors A2a Rat striatal adenosine A2a receptor
Type:
G Protein-Coupled Receptor (GPCR)
Mol. Mass.:
45015.65
Organism:
Rattus norvegicus (rat)
Description:
Rat A2A receptors expressed in CHO cells.
Residue:
410
  
Inhibitor
Name:
BDBM50025883
Synonyms:
(2R,3S,5R)-5-(6-amino-9H-purin-9-yl)-2-(hydroxymethyl)tetrahydrofuran-3-ol 2'-Deoxyadenosine 2'deoxyadenosine CHEMBL416340 | DEOXYADENOSINE
Type:
Small organic molecule
Emp. Form.:
C10H13N5O3
Mol. Mass.:
251.2419
SMILES:
Nc1ncnc2n(cnc12)C1CC(O)C(CO)O1
: