Target
Transmembrane and immunoglobulin domain-containing 3
Ligand
BDBM82536
Substrate
Ki
81200±n/a nM
Comments
PDSP_2581
Citation
 van Galen, PJvan Bergen, AHGallo-Rodriguez, CMelman, NOlah, MEIJzerman, APStiles, GLJacobson, KA A binding site model and structure-activity relationships for the rat A3 adenosine receptor. Mol Pharmacol 45:1101-11 (1994) Target
Name:
Transmembrane and immunoglobulin domain-containing 3
Synonyms:
ADENOSINE A3 Adora3 protein
Type:
Enzyme Catalytic Domain
Mol. Mass.:
25707.75
Organism:
RAT
Description:
Q4V8H0
Residue:
232
  
Inhibitor
Name:
BDBM82536
Synonyms:
1,3-DipropylX-7-riboside
Type:
Small organic molecule
Emp. Form.:
C16H31N5O4
Mol. Mass.:
357.4484
SMILES:
CCCN1CN(CCC)C2=NCN([C@H]3O[C@@H](CO)[C@H](O)[C@@H]3O)C2C1N
: