Target
Transmembrane and immunoglobulin domain-containing 3
Ligand
BDBM82521
Substrate
Ki
>10000±n/a nM
Comments
PDSP_2577
Citation
 van Galen, PJvan Bergen, AHGallo-Rodriguez, CMelman, NOlah, MEIJzerman, APStiles, GLJacobson, KA A binding site model and structure-activity relationships for the rat A3 adenosine receptor. Mol Pharmacol 45:1101-11 (1994) Target
Name:
Transmembrane and immunoglobulin domain-containing 3
Synonyms:
ADENOSINE A3 Adora3 protein
Type:
Enzyme Catalytic Domain
Mol. Mass.:
25707.75
Organism:
RAT
Description:
Q4V8H0
Residue:
232
  
Inhibitor
Name:
BDBM82521
Synonyms:
3,9-DimethylX 3,9-dimethyl-3,9-dihydro-1h-purine-2,6-dione
Type:
Small organic molecule
Emp. Form.:
C7H8N4O2
Mol. Mass.:
180.164
SMILES:
Cn1cnc2c1n(C)c(=O)[nH]c2=O
: