Target
Transmembrane and immunoglobulin domain-containing 3
Ligand
BDBM82541
Substrate
Ki
3090±n/a nM
Comments
PDSP_2592
Citation
 van Galen, PJvan Bergen, AHGallo-Rodriguez, CMelman, NOlah, MEIJzerman, APStiles, GLJacobson, KA A binding site model and structure-activity relationships for the rat A3 adenosine receptor. Mol Pharmacol 45:1101-11 (1994) Target
Name:
Transmembrane and immunoglobulin domain-containing 3
Synonyms:
ADENOSINE A3 Adora3 protein
Type:
Enzyme Catalytic Domain
Mol. Mass.:
25707.75
Organism:
RAT
Description:
Q4V8H0
Residue:
232
  
Inhibitor
Name:
BDBM82541
Synonyms:
Adenosine-N1-oxide NSC_67358
Type:
Small organic molecule
Emp. Form.:
C10H13N5O5
Mol. Mass.:
283.2407
SMILES:
Nc1ncnc2n(c[n+]([O-])c12)C1OC(CO)C(O)C1O
: