Target
Transmembrane and immunoglobulin domain-containing 3
Ligand
BDBM82539
Substrate
Ki
>10000±n/a nM
Comments
PDSP_2562
Citation
 van Galen, PJvan Bergen, AHGallo-Rodriguez, CMelman, NOlah, MEIJzerman, APStiles, GLJacobson, KA A binding site model and structure-activity relationships for the rat A3 adenosine receptor. Mol Pharmacol 45:1101-11 (1994) Target
Name:
Transmembrane and immunoglobulin domain-containing 3
Synonyms:
ADENOSINE A3 Adora3 protein
Type:
Enzyme Catalytic Domain
Mol. Mass.:
25707.75
Organism:
RAT
Description:
Q4V8H0
Residue:
232
  
Inhibitor
Name:
BDBM82539
Synonyms:
beta-D-Psicofuranosyladenine
Type:
Small organic molecule
Emp. Form.:
C11H15N5O5
Mol. Mass.:
297.2673
SMILES:
Nc1ncnc2n(cnc12)[C@@]1(CO)O[C@H](CO)[C@@H](O)[C@H]1O
: