Target
Transmembrane and immunoglobulin domain-containing 3
Ligand
BDBM82540
Substrate
Ki
>10000±n/a nM
Comments
PDSP_2563
Citation
 van Galen, PJvan Bergen, AHGallo-Rodriguez, CMelman, NOlah, MEIJzerman, APStiles, GLJacobson, KA A binding site model and structure-activity relationships for the rat A3 adenosine receptor. Mol Pharmacol 45:1101-11 (1994) Target
Name:
Transmembrane and immunoglobulin domain-containing 3
Synonyms:
ADENOSINE A3 Adora3 protein
Type:
Enzyme Catalytic Domain
Mol. Mass.:
25707.75
Organism:
RAT
Description:
Q4V8H0
Residue:
232
  
Inhibitor
Name:
BDBM82540
Synonyms:
CAS_146-80-5 Xanthosine
Type:
Small organic molecule
Emp. Form.:
C10H13N4O9P
Mol. Mass.:
364.2054
SMILES:
OC1C(COP(O)(O)=O)OC(C1O)n1cnc2c1[nH]c(=O)[nH]c2=O
: