Target
Kynurenine/alpha-aminoadipate aminotransferase, mitochondrial
Ligand
BDBM273030
Substrate
Meas. Tech.
KAT-II inhibitory assay
pH
8±n/a
IC50
6.10±n/a nM
Comments
extracted
Citation
 Okuyama, MFukunaga, KUsui, KHayashi, NIijima, DHoriuchi, HItagaki, N Bicyclic or tricyclic heterocyclic compound US Patent  US10065972 Publication Date 9/4/2018 
Target
Name:
Kynurenine/alpha-aminoadipate aminotransferase, mitochondrial
Synonyms:
2-aminoadipate aminotransferase AADAT Alpha-aminoadipate aminotransferase KAT2 Kynurenine aminotransferase II Kynurenine--oxoglutarate aminotransferase II Kynurenine--oxoglutarate transaminase II
Type:
Enzyme
Mol. Mass.:
47353.09
Organism:
Homo sapiens (Human)
Description:
Q8N5Z0
Residue:
425
  
Inhibitor
Name:
BDBM273030
Synonyms:
(R)-2-[5-(1-cyanocyclopropyl)-7-oxo-6,7-dihydro[1,3]thiazolo[5,4-d]pyrimidin-2-yl]pyrrolidine-1-carboxylic acid 3-methylphenyl ester | US10065972, Example 94
Type:
Small organic molecule
Emp. Form.:
C21H19N5O3S
Mol. Mass.:
421.472
SMILES:
Cc1cccc(OC(=O)N2CCC[C@@H]2c2nc3c(nc([nH]c3=O)C3(CC3)C#N)s2)c1
: