Target
Kynurenine/alpha-aminoadipate aminotransferase, mitochondrial
Ligand
BDBM273091
Substrate
Meas. Tech.
KAT-II inhibitory assay
pH
8±n/a
IC50
4.30±n/a nM
Comments
extracted
Citation
 Okuyama, MFukunaga, KUsui, KHayashi, NIijima, DHoriuchi, HItagaki, N Bicyclic or tricyclic heterocyclic compound US Patent  US10065972 Publication Date 9/4/2018 
Target
Name:
Kynurenine/alpha-aminoadipate aminotransferase, mitochondrial
Synonyms:
2-aminoadipate aminotransferase AADAT Alpha-aminoadipate aminotransferase KAT2 Kynurenine aminotransferase II Kynurenine--oxoglutarate aminotransferase II Kynurenine--oxoglutarate transaminase II
Type:
Enzyme
Mol. Mass.:
47353.09
Organism:
Homo sapiens (Human)
Description:
Q8N5Z0
Residue:
425
  
Inhibitor
Name:
BDBM273091
Synonyms:
(R)-N-benzyl-1-[6-methyl-7-oxo-5-(tetrahydro-2H-pyran-4-yl)-6,7-dihydro[1,3]thiazolo[5,4-d]pyrimidin-2-yl]pyrrolidine-2-carboxamide | US10065972, Example 259
Type:
Small organic molecule
Emp. Form.:
C23H27N5O3S
Mol. Mass.:
453.557
SMILES:
Cn1c(nc2sc(nc2c1=O)N1CCC[C@@H]1C(=O)NCc1ccccc1)C1CCOCC1
: