Target
Kynurenine/alpha-aminoadipate aminotransferase, mitochondrial
Ligand
BDBM273157
Substrate
Meas. Tech.
KAT-II inhibitory assay
pH
8±n/a
IC50
4.90±n/a nM
Comments
extracted
Citation
 Okuyama, MFukunaga, KUsui, KHayashi, NIijima, DHoriuchi, HItagaki, N Bicyclic or tricyclic heterocyclic compound US Patent  US10065972 Publication Date 9/4/2018 
Target
Name:
Kynurenine/alpha-aminoadipate aminotransferase, mitochondrial
Synonyms:
2-aminoadipate aminotransferase AADAT Alpha-aminoadipate aminotransferase KAT2 Kynurenine aminotransferase II Kynurenine--oxoglutarate aminotransferase II Kynurenine--oxoglutarate transaminase II
Type:
Enzyme
Mol. Mass.:
47353.09
Organism:
Homo sapiens (Human)
Description:
Q8N5Z0
Residue:
425
  
Inhibitor
Name:
BDBM273157
Synonyms:
(R)-N-benzyl-1-(5-methyl-9-oxo-5,9-dihydroimidazo[1,2-a][1,3]thiazolo[5,4-d]pyrimidin-2-yl)pyrrolidine-2-carboxamide | US10065972, Example 603
Type:
Small organic molecule
Emp. Form.:
C20H20N6O2S
Mol. Mass.:
408.477
SMILES:
Cn1ccn2c1nc1sc(nc1c2=O)N1CCC[C@@H]1C(=O)NCc1ccccc1
: