Target
Nicotinic acetylcholine receptor
Ligand
BDBM50121739
Substrate
Ki
>10000±n/a nM
Comments
PDSP_440
Citation
 Khan, IMYaksh, TLTaylor, P Ligand specificity of nicotinic acetylcholine receptors in rat spinal cord: studies with nicotine and cytisine. J Pharmacol Exp Ther 270:159-66 (1994) Target
Name:
Nicotinic acetylcholine receptor
Synonyms:
Nicotinic acetylcholine receptor | n-AChR
Type:
Enzyme Catalytic Domain
Mol. Mass.:
2478.99
Organism:
RAT
Description:
n-AChR 0 RAT::Q62594
Residue:
23
  
Inhibitor
Name:
BDBM50121739
Synonyms:
Bungarotoxin Neuronal CHEMBL216458 | alpha-bungarotoxin
Type:
Small organic molecule
Emp. Form.:
C50H70O14
Mol. Mass.:
895.0824
SMILES:
C[C@@H]1C[C@@H]2O[C@@H]3C[C@@H]4OC(=O)C=C(C)[C@H]4O[C@@]3(C)C[C@H]2O[C@H]2CC[C@@]3(C)O[C@@]4(C)C[C@H]5O[C@H]6C[C@H]7O[C@@]8(C)[C@@H](O)C[C@H](CC(=C)C=O)O[C@@H]8C[C@@H]7O[C@@H]6\C=C/C[C@]5(C)O[C@@H]4C[C@@H]3O[C@H]12
: