Target
Muscarinic acetylcholine receptor M2
Ligand
BDBM82439
Substrate
Ki
>10000±n/a nM
Comments
PDSP_237
Citation
 Stanton, TBolden-Watson, CCusack, BRichelson, E Antagonism of the five cloned human muscarinic cholinergic receptors expressed in CHO-K1 cells by antidepressants and antihistaminics. Biochem Pharmacol 45:2352-4 (1993)  
Target
Name:
Muscarinic acetylcholine receptor M2
Synonyms:
ACM2_HUMAN Cholinergic, muscarinic M2 Muscarinic acetylcholine receptor M2 and M5 | RecName: Full=Muscarinic acetylcholine receptor M2
Type:
GPCR
Mol. Mass.:
51730.61
Organism:
Homo sapiens (Human)
Description:
P08172
Residue:
466
  
Inhibitor
Name:
BDBM82439
Synonyms:
Adinazolam NSC_37632
Type:
Small organic molecule
Emp. Form.:
C19H18ClN5
Mol. Mass.:
351.833
SMILES:
CN(C)Cc1nnc2CN=C(c3ccccc3)c3cc(Cl)ccc3-n12
: