Target
Muscarinic acetylcholine receptor M2
Ligand
BDBM82217
Substrate
Ki
2100±n/a nM
Comments
PDSP_1710
Citation
 Stanton, TBolden-Watson, CCusack, BRichelson, E Antagonism of the five cloned human muscarinic cholinergic receptors expressed in CHO-K1 cells by antidepressants and antihistaminics. Biochem Pharmacol 45:2352-4 (1993)  
Target
Name:
Muscarinic acetylcholine receptor M2
Synonyms:
ACM2_HUMAN Cholinergic, muscarinic M2 Muscarinic acetylcholine receptor M2 and M5 | RecName: Full=Muscarinic acetylcholine receptor M2
Type:
GPCR
Mol. Mass.:
51730.61
Organism:
Homo sapiens (Human)
Description:
P08172
Residue:
466
  
Inhibitor
Name:
BDBM82217
Synonyms:
CHEMBL284994 SERTRALINE | [4-(3,4-Dichloro-phenyl)-1,2,3,4-tetrahydro-naphthalen-1-yl]-methyl-amine
Type:
Emp. Form.:
C17H17Cl2N
Mol. Mass.:
306.23
SMILES:
CN[C@@H]1CC[C@@H](c2ccc(Cl)c(Cl)c2)c2ccccc12
: