Target
Muscarinic acetylcholine receptor M4
Ligand
BDBM82437
Substrate
Ki
340±n/a nM
Comments
PDSP_1088
Citation
 Stanton, TBolden-Watson, CCusack, BRichelson, E Antagonism of the five cloned human muscarinic cholinergic receptors expressed in CHO-K1 cells by antidepressants and antihistaminics. Biochem Pharmacol 45:2352-4 (1993)  
Target
Name:
Muscarinic acetylcholine receptor M4
Synonyms:
ACM4_HUMAN Cholinergic, muscarinic M4 Muscarinic acetylcholine receptor M2 and M4
Type:
Enzyme Catalytic Domain
Mol. Mass.:
53079.31
Organism:
Homo sapiens (Human)
Description:
Cholinergic, muscarinic M4 CHRM4 HUMAN M3::P08173
Residue:
479
  
Inhibitor
Name:
BDBM82437
Synonyms:
CAS_23047-25-8 NSC_3947 | US8629135, SW-06
Type:
Small organic molecule
Emp. Form.:
C26H27ClN2O
Mol. Mass.:
418.958
SMILES:
CN(CCCN1c2ccccc2CCc2ccccc12)CC(=O)c1ccc(Cl)cc1
: