Target
D(4) dopamine receptor
Ligand
BDBM81924
Substrate
Ki
545.7±n/a nM
Comments
PDSP_1522
Citation
 Lahti, RAEvans, DLStratman, NCFigur, LM Dopamine D4 versus D2 receptor selectivity of dopamine receptor antagonists: possible therapeutic implications. Eur J Pharmacol 236:483-6 (1993)  
Target
Name:
D(4) dopamine receptor
Synonyms:
D(2C) dopamine receptor DOPAMINE D4.2 DRD4 Dopamine D4 receptor
Type:
Enzyme
Mol. Mass.:
48373.19
Organism:
Homo sapiens (Human)
Description:
P21917
Residue:
419
  
Inhibitor
Name:
BDBM81924
Synonyms:
(R)-3-(1-Propyl-piperidin-3-yl)-phenol CAS_85976-54-1 NSC_202477 PPP, S(-)-3
Type:
Small organic molecule
Emp. Form.:
C14H21NO
Mol. Mass.:
219.3226
SMILES:
CCCN1CCCC(C1)c1cccc(O)c1
: