Target
Mu-type opioid receptor
Ligand
BDBM50018708
Substrate
Ki
39±n/a nM
Comments
PDSP_758
Citation
 Raynor, KKong, HChen, YYasuda, KYu, LBell, GIReisine, T Pharmacological characterization of the cloned kappa-, delta-, and mu-opioid receptors. Mol Pharmacol 45:330-4 (1994) Target
Name:
Mu-type opioid receptor
Synonyms:
M-OR-1 MOR-1 MUOR1 Mu opiate receptor OPRM1 hMOP | mu-type opioid receptor isoform MOR-1
Type:
G Protein-Coupled Receptor (GPCR)
Mol. Mass.:
44789.51
Organism:
Homo sapiens (Human)
Description:
P35372
Residue:
400
  
Inhibitor
Name:
BDBM50018708
Synonyms:
2-{2-[2-(2-{2-[2-Amino-3-(4-hydroxy-phenyl)-propionylamino]-3-hydroxy-propionylamino}-acetylamino)-3-phenyl-propionylamino]-4-methyl-pentanoylamino}-3-hydroxy-butyric acid DSLET Tyr-D-Ser-Gly-Phe-Leu-Thr
Type:
Small organic molecule
Emp. Form.:
C33H46N6O10
Mol. Mass.:
686.7525
SMILES:
CC(C)C[C@H](NC(=O)[C@H](Cc1ccccc1)NC(=O)CNC(=O)[C@@H](CO)NC(=O)[C@@H](N)Cc1ccc(O)cc1)C(=O)N[C@@H]([C@@H](C)O)C(O)=O
: