Target
Glutamate receptor ionotropic, kainate 4
Ligand
BDBM50240399
Substrate
Ki
3840±n/a nM
Comments
PDSP_668
Citation
 Kamboj, RKSchoepp, DDNutt, SShekter, LKorczak, BTrue, RARampersad, VZimmerman, DMWosnick, MA Molecular cloning, expression, and pharmacological characterization of humEAA1, a human kainate receptor subunit. J Neurochem 62:1-9 (1994)  
Target
Name:
Glutamate receptor ionotropic, kainate 4
Synonyms:
GRIK GRIK4 protein Glutamate-Kainate EAA1
Type:
Enzyme Catalytic Domain
Mol. Mass.:
107246.86
Organism:
Homo sapiens (Human)
Description:
Q16099
Residue:
956
  
Inhibitor
Name:
BDBM50240399
Synonyms:
(2R,3R,4S)-3-(carboxymethyl)-4-isopropylpyrrolidinium-2-carboxylate (2S,3S,4R)-4-isopropyl-3-(2-oxido-2-oxoethyl)pyrrolidinium-2-carboxylate Dihydrokainate | dihydrokainic acid
Type:
Small organic molecule
Emp. Form.:
C10H17NO4
Mol. Mass.:
215.2463
SMILES:
CC(C)[C@H]1CN[C@@H]([C@H]1CC(O)=O)C(O)=O
: