Target
D(2) dopamine receptor
Ligand
BDBM25753
Substrate
Ki
>10000±n/a nM
Comments
PDSP_3857
Citation
 Kessler, RMVotaw, JRde Paulis, TBingham, DRAnsari, MSMason, NSHolburn, GSchmidt, DEVotaw, DBManning, RG Evaluation of 5-[18F]fluoropropylepidepride as a potential PET radioligand for imaging dopamine D2 receptors. Synapse 15:169-76 (1993)  
Target
Name:
D(2) dopamine receptor
Synonyms:
DOPAMINE D2 DOPAMINE D2 Short Dopamine D2 receptor Drd2
Type:
G Protein-Coupled Receptor (GPCR)
Mol. Mass.:
50931.60
Organism:
Rattus norvegicus (rat)
Description:
P61169
Residue:
444
  
Inhibitor
Name:
BDBM25753
Synonyms:
2-{4-[2-hydroxy-3-(propan-2-ylamino)propoxy]phenyl}acetamide Atenolol Tenormin | Tenormine
Type:
Small organic molecule
Emp. Form.:
C14H22N2O3
Mol. Mass.:
266.3361
SMILES:
CC(C)NCC(O)COc1ccc(CC(N)=O)cc1
: