Target
5-hydroxytryptamine receptor 2A
Ligand
BDBM82518
Substrate
Ki
1621.81±n/a nM
Comments
PDSP_1183
Citation
 Millan, MJCanton, HGobert, ALejeune, FRivet, JMBervoets, KBrocco, MWiddowson, PMennini, TAudinot, V Novel benzodioxopiperazines acting as antagonists at postsynaptic 5-HT1A receptors and as agonists at 5-HT1A autoreceptors: a comparative pharmacological characterization with proposed 5-HT1A antagonists. J Pharmacol Exp Ther 268:337-52 (1994) Target
Name:
5-hydroxytryptamine receptor 2A
Synonyms:
5-HT-2A 5-HT2A 5-hydroxytryptamine receptor 2A (5HT2A) Htr2 Serotonin Receptor 2A
Type:
G Protein-Coupled Receptor (GPCR)
Mol. Mass.:
52852.05
Organism:
Rattus norvegicus (rat)
Description:
Rat cortex membranes 5-HT2A receptors.
Residue:
471
  
Inhibitor
Name:
BDBM82518
Synonyms:
CAS_124756-23-6 | MDL 73005 EF
Type:
Small organic molecule
Emp. Form.:
C20H26N2O4
Mol. Mass.:
358.4314
SMILES:
O=C1CC2(CCCC2)CC(=O)N1CCNCC1COc2ccccc2O1
: