Target
D(3) dopamine receptor
Ligand
BDBM85091
Substrate
Ki
0.68±n/a nM
Comments
PDSP_244
Citation
 Freedman, SBPatel, SMarwood, REmms, FSeabrook, GRKnowles, MRMcAllister, G Expression and pharmacological characterization of the human D3 dopamine receptor. J Pharmacol Exp Ther 268:417-26 (1994) Target
Name:
D(3) dopamine receptor
Synonyms:
DOPAMINE D3 DRD3_HUMAN Dopamine D3 receptor (D3) Dopamine receptor Dopamine receptor D3
Type:
Mol. Mass.:
44243.43
Organism:
Homo sapiens (Human)
Description:
Residue:
400
  
Inhibitor
Name:
BDBM85091
Synonyms:
(+/-)-2-DIPROPYLAMINO- 6,7-DIHYDROXY-1,2,3,4-TETRAHYDRONAPHTHALENE CAS_62421-17-4 dp-ADTN
Type:
Small organic molecule
Emp. Form.:
C16H25NO2
Mol. Mass.:
263.3752
SMILES:
CCCN(CCC)C1CCc2cc(O)c(O)cc2C1
: