Target
Phospholipase A2
Ligand
BDBM80874
Substrate
Meas. Tech.
Dose response counterscreen of uHTS hits for ATG4B inhibitors in a Phospholipase A2 assay
IC50
4750±n/a nM
Citation
 PubChem, PC Dose response counterscreen of uHTS hits for ATG4B inhibitors in a Phospholipase A2 assay PubChem Bioassay (2011)[AID] 
Target
Name:
Phospholipase A2
Synonyms:
Group IB phospholipase A2 PLA2 PLA2G1B Phosphatidylcholine 2-acylhydrolase 1B Phospholipase A2 group 1B | phospholipase A2 precursor
Type:
Protein
Mol. Mass.:
16364.13
Organism:
Homo sapiens (Human)
Description:
P04054
Residue:
148
  
Inhibitor
Name:
BDBM80874
Synonyms:
1-[2-(4-tert-butylphenoxy)ethyl]-7-methyl-1H-indole-2,3-dione 1-[2-(4-tert-butylphenoxy)ethyl]-7-methyl-isatin MLS000580079 cid_2200159
Type:
Small organic molecule
Emp. Form.:
C21H23NO3
Mol. Mass.:
337.4122
SMILES:
Cc1cccc2C(=O)C(=O)N(CCOc3ccc(cc3)C(C)(C)C)c12
: