Target
Phospholipase A2
Ligand
BDBM32329
Substrate
Meas. Tech.
Dose response counterscreen of uHTS hits for ATG4B inhibitors in a Phospholipase A2 assay
IC50
7860±n/a nM
Citation
 PubChem, PC Dose response counterscreen of uHTS hits for ATG4B inhibitors in a Phospholipase A2 assay PubChem Bioassay (2011)[AID] 
Target
Name:
Phospholipase A2
Synonyms:
Group IB phospholipase A2 PLA2 PLA2G1B Phosphatidylcholine 2-acylhydrolase 1B Phospholipase A2 group 1B | phospholipase A2 precursor
Type:
Protein
Mol. Mass.:
16364.13
Organism:
Homo sapiens (Human)
Description:
P04054
Residue:
148
  
Inhibitor
Name:
BDBM32329
Synonyms:
(2Z)-3-ethyl-2-[(E)-3-(3-ethyl-1,3-benzothiazol-3-ium-2-yl)-2-methyl-prop-2-enylidene]-1,3-benzothiazole;iodide Cyanines, 1 SMR000354813 | cid_6364517
Type:
Small organic molecule
Emp. Form.:
C22H23N2S2
Mol. Mass.:
379.561
SMILES:
CCN1\C(Sc2ccccc12)=C\C(\C)=C\c1sc2ccccc2[n+]1CC
: