Target
Delta-type opioid receptor
Ligand
BDBM50039024
Substrate
Meas. Tech.
Counterscreen for agonists of heterodimerization of the mu 1 (OPRM1) and delta 1 (OPRD1) opioid receptors: Luminescence-based cell-based high throughput dose response assay
EC50
10.74±n/a nM
Citation
 PubChem, PC Counterscreen for agonists of heterodimerization of the mu 1 (OPRM1) and delta 1 (OPRD1) opioid receptors: Luminescence-based cell-based high throughput dose response assay to identify agonists of OPRD1 homodimerization PubChem Bioassay (2011)[AID] 
Target
Name:
Delta-type opioid receptor
Synonyms:
D-OR-1 Delta opioid receptor OPIATE Delta OPRD1 OPRK1 | opioid receptor, delta 1
Type:
G Protein-Coupled Receptor (GPCR)
Mol. Mass.:
40382.98
Organism:
Homo sapiens (Human)
Description:
Competition binding assays were carried out using membrane preparations from transfected HN9.10 cells that constitutively expressed the delta opioid receptor.
Residue:
372
  
Inhibitor
Name:
BDBM50039024
Synonyms:
4-[(S)-((2R,5S)-4-Allyl-2,5-dimethyl-piperazin-1-yl)-(3-methoxy-phenyl)-methyl]-N,N-diethyl-benzamide cid_16219954
Type:
Small organic molecule
Emp. Form.:
C28H39N3O2
Mol. Mass.:
449.6282
SMILES:
CCN(CC)C(=O)c1ccc(cc1)[C@H](N1C[C@H](C)N(CC=C)C[C@H]1C)c1cccc(OC)c1
: