Target
Endoribonuclease toxin MazF
Ligand
BDBM52143
Substrate
Meas. Tech.
Dose response confirmation uHTS hits for MazEF TA System activators via a fluorescence-based single-stranded RNase assay counterscreen
EC50
>99000±n/a nM
Citation
 PubChem, PC Dose response confirmation uHTS hits for MazEF TA System activators via a fluorescence-based single-stranded RNase assay counterscreen PubChem Bioassay (2011)[AID] 
Target
Name:
Endoribonuclease toxin MazF
Synonyms:
MAZF_ECOLI chpAK mazF
Type:
Enzyme Catalytic Domain
Mol. Mass.:
12100.43
Organism:
Escherichia coli str. K-12 substr. MG1655
Description:
gi_16130689
Residue:
111
  
Inhibitor
Name:
BDBM52143
Synonyms:
2-cyano-N-(phenylmethyl)-2-(3-pyrrolidin-1-ylquinoxalin-2-yl)ethanamide MLS000057770 N-benzyl-2-cyano-2-(3-pyrrolidinoquinoxalin-2-yl)acetamide cid_2998487
Type:
Small organic molecule
Emp. Form.:
C22H21N5O
Mol. Mass.:
371.435
SMILES:
O=C(NCc1ccccc1)C(C#N)c1nc2ccccc2nc1N1CCCC1
: