Target
Endoribonuclease toxin MazF
Ligand
BDBM83652
Substrate
Meas. Tech.
Dose response confirmation uHTS hits for MazEF TA System activators via a fluorescence-based single-stranded RNase assay counterscreen
EC50
4480±n/a nM
Citation
 PubChem, PC Dose response confirmation uHTS hits for MazEF TA System activators via a fluorescence-based single-stranded RNase assay counterscreen PubChem Bioassay (2011)[AID] 
Target
Name:
Endoribonuclease toxin MazF
Synonyms:
MAZF_ECOLI chpAK mazF
Type:
Enzyme Catalytic Domain
Mol. Mass.:
12100.43
Organism:
Escherichia coli str. K-12 substr. MG1655
Description:
gi_16130689
Residue:
111
  
Inhibitor
Name:
BDBM83652
Synonyms:
9H-fluorene-2,7-disulfonohydrazide SMR000556375 | cid_2136107
Type:
Small organic molecule
Emp. Form.:
C13H14N4O4S2
Mol. Mass.:
354.405
SMILES:
NNS(=O)(=O)c1ccc-2c(Cc3cc(ccc-23)S(=O)(=O)NN)c1
: