Target
Apoptotic protease-activating factor 1
Ligand
BDBM40313
Substrate
Meas. Tech.
Dose response confirmation of uHTS hits for Apaf-1 in a Fluorescent assay
IC50
316±n/a nM
Citation
 PubChem, PC Dose response confirmation of uHTS hits for Apaf-1 in a Fluorescent assay PubChem Bioassay (2011)[AID] 
Target
Name:
Apoptotic protease-activating factor 1
Synonyms:
APAF1 Apoptotic peptidase activating factor 1 | KIAA0413
Type:
Enzyme Catalytic Domain
Mol. Mass.:
141834.40
Organism:
Homo sapiens (Human)
Description:
O14727
Residue:
1248
  
Inhibitor
Name:
BDBM40313
Synonyms:
3-phenyl-9,10-phenanthrenedione 3-phenylphenanthrene-9,10-quinone SMR000115581 | cid_9549141
Type:
Small organic molecule
Emp. Form.:
C20H12O2
Mol. Mass.:
284.3081
SMILES:
O=C1C(=O)c2ccc(cc2-c2ccccc12)-c1ccccc1
: