Target
Apoptotic protease-activating factor 1
Ligand
BDBM54763
Substrate
Meas. Tech.
Dose response confirmation of uHTS hits for Apaf-1 in a Fluorescent assay
IC50
2920±n/a nM
Citation
 PubChem, PC Dose response confirmation of uHTS hits for Apaf-1 in a Fluorescent assay PubChem Bioassay (2011)[AID] 
Target
Name:
Apoptotic protease-activating factor 1
Synonyms:
APAF1 Apoptotic peptidase activating factor 1 | KIAA0413
Type:
Enzyme Catalytic Domain
Mol. Mass.:
141834.40
Organism:
Homo sapiens (Human)
Description:
O14727
Residue:
1248
  
Inhibitor
Name:
BDBM54763
Synonyms:
4-[[3-chloranyl-1,4-bis(oxidanylidene)naphthalen-2-yl]-ethanoyl-amino]benzoic acid 4-[acetyl-(3-chloro-1,4-diketo-2-naphthyl)amino]benzoic acid 4-[acetyl-(3-chloro-1,4-dioxonaphthalen-2-yl)amino]benzoic acid SMR000555847 | cid_24761366
Type:
Small organic molecule
Emp. Form.:
C19H12ClNO5
Mol. Mass.:
369.755
SMILES:
CC(=O)N(C1=C(Cl)C(=O)c2ccccc2C1=O)c1ccc(cc1)C(O)=O
: