Target
Apoptotic protease-activating factor 1
Ligand
BDBM22857
Substrate
Meas. Tech.
Dose response confirmation of uHTS hits for Apaf-1 in a Fluorescent assay
IC50
549±n/a nM
Citation
 PubChem, PC Dose response confirmation of uHTS hits for Apaf-1 in a Fluorescent assay PubChem Bioassay (2011)[AID] 
Target
Name:
Apoptotic protease-activating factor 1
Synonyms:
APAF1 Apoptotic peptidase activating factor 1 | KIAA0413
Type:
Enzyme Catalytic Domain
Mol. Mass.:
141834.40
Organism:
Homo sapiens (Human)
Description:
O14727
Residue:
1248
  
Inhibitor
Name:
BDBM22857
Synonyms:
1,2-Dione-Based Compound, 14 CHEMBL51931 cid_6763
Type:
Small organic molecule
Emp. Form.:
C14H8O2
Mol. Mass.:
208.2121
SMILES:
O=C1C(=O)c2ccccc2-c2ccccc12
: