Target
Apoptotic protease-activating factor 1
Ligand
BDBM38837
Substrate
Meas. Tech.
Dose Response validation of Inhibitors of Apaf-1 using a Fluorescent Interference Counterscreen assay
IC50
>100000±0 nM
Citation
 PubChem, PC Dose Response validation of Inhibitors of Apaf-1 using a Fluorescent Interference Counterscreen assay PubChem Bioassay (2011)[AID] 
Target
Name:
Apoptotic protease-activating factor 1
Synonyms:
APAF1 Apoptotic peptidase activating factor 1 | KIAA0413
Type:
Enzyme Catalytic Domain
Mol. Mass.:
141834.40
Organism:
Homo sapiens (Human)
Description:
O14727
Residue:
1248
  
Inhibitor
Name:
BDBM38837
Synonyms:
2-(2-phenylethyl)-4H-isoquinoline-1,3-dione MLS000119149 cid_713096
Type:
Small organic molecule
Emp. Form.:
C17H15NO2
Mol. Mass.:
265.3065
SMILES:
O=C1Cc2ccccc2C(=O)N1CCc1ccccc1
: