Target
Apoptotic protease-activating factor 1
Ligand
BDBM83998
Substrate
Meas. Tech.
Dose Response confirmation of uHTS Activators of the Apaf-1 Pathway in Fluorescent format
EC50
22900±n/a nM
Citation
 PubChem, PC Dose Response confirmation of uHTS Activators of the Apaf-1 Pathway in Fluorescent format PubChem Bioassay (2011)[AID] 
Target
Name:
Apoptotic protease-activating factor 1
Synonyms:
APAF1 Apoptotic peptidase activating factor 1 | KIAA0413
Type:
Enzyme Catalytic Domain
Mol. Mass.:
141834.40
Organism:
Homo sapiens (Human)
Description:
O14727
Residue:
1248
  
Inhibitor
Name:
BDBM83998
Synonyms:
4-(4-bromophenyl)-2-[1-(2-cyanoethyl)-3-indolyl]-4-oxobutanoic acid 4-(4-bromophenyl)-2-[1-(2-cyanoethyl)indol-3-yl]-4-oxidanylidene-butanoic acid MLS000120573 cid_5308016
Type:
Small organic molecule
Emp. Form.:
C21H17BrN2O3
Mol. Mass.:
425.275
SMILES:
OC(=O)C(CC(=O)c1ccc(Br)cc1)c1cn(CCC#N)c2ccccc12
: