Target
Apoptotic protease-activating factor 1
Ligand
BDBM54768
Substrate
Meas. Tech.
Dose Response confirmation of uHTS Activators of the Apaf-1 Pathway in Fluorescent format
EC50
1160±n/a nM
Citation
 PubChem, PC Dose Response confirmation of uHTS Activators of the Apaf-1 Pathway in Fluorescent format PubChem Bioassay (2011)[AID] 
Target
Name:
Apoptotic protease-activating factor 1
Synonyms:
APAF1 Apoptotic peptidase activating factor 1 | KIAA0413
Type:
Enzyme Catalytic Domain
Mol. Mass.:
141834.40
Organism:
Homo sapiens (Human)
Description:
O14727
Residue:
1248
  
Inhibitor
Name:
BDBM54768
Synonyms:
2-[3-[2-hydroxyethyl(dimethyl)ammonio]propanoylamino]-2-methyl-propane-1-sulfonate 2-[3-[2-hydroxyethyl(dimethyl)azaniumyl]propanoylamino]-2-methylpropane-1-sulfonate MLS000554255 US20230364057, Compound 42 | cid_1973720
Type:
Small organic molecule
Emp. Form.:
C11H24N2O5S
Mol. Mass.:
296.384
SMILES:
CC(C)(CS([O-])(=O)=O)NC(=O)CC[N+](C)(C)CCO
: