Target
Apoptotic protease-activating factor 1
Ligand
BDBM61723
Substrate
Meas. Tech.
Dose Response confirmation of uHTS Activators of the Apaf-1 Pathway in Fluorescent format
EC50
2960±n/a nM
Citation
 PubChem, PC Dose Response confirmation of uHTS Activators of the Apaf-1 Pathway in Fluorescent format PubChem Bioassay (2011)[AID] 
Target
Name:
Apoptotic protease-activating factor 1
Synonyms:
APAF1 Apoptotic peptidase activating factor 1 | KIAA0413
Type:
Enzyme Catalytic Domain
Mol. Mass.:
141834.40
Organism:
Homo sapiens (Human)
Description:
O14727
Residue:
1248
  
Inhibitor
Name:
BDBM61723
Synonyms:
(8S)-3-[3-[(2-methyl-1-oxoprop-2-enyl)amino]phenyl]-7-(1-oxohexyl)-1-oxa-2,7-diazaspiro[4.4]non-2-ene-8-carboxamide (8S)-7-hexanoyl-3-[3-(2-methylprop-2-enoylamino)phenyl]-1-oxa-2,7-diazaspiro[4.4]non-2-ene-8-carboxamide SMR000390642 | cid_16745484
Type:
Small organic molecule
Emp. Form.:
C23H30N4O4
Mol. Mass.:
426.5087
SMILES:
CCCCCC(=O)N1CC2(C[C@H]1C(N)=O)CC(=NO2)c1cccc(NC(=O)C(C)=C)c1
: