Target
Caspase-9
Ligand
BDBM30762
Substrate
Meas. Tech.
Dose response confirmation of uHTS hits for Apaf-1 using a LZ-Caspase-9/Caspase-3 Fluorescent Selectivity assay
IC50
6980±n/a nM
Citation
 PubChem, PC Dose response confirmation of uHTS hits for Apaf-1 using a LZ-Caspase-9/Caspase-3 Fluorescent Selectivity assay PubChem Bioassay (2011)[AID] 
Target
Name:
Caspase-9
Synonyms:
Apoptotic protease-activating factor 1/Caspase-3/Caspase-9/Cytochrome c CASP-9 CASP9_HUMAN ICE-like apoptotic protease 6 caspase-9 isoform alpha preproprotein
Type:
Enzyme
Mol. Mass.:
46277.29
Organism:
Homo sapiens (Human)
Description:
Residue:
416
  
Inhibitor
Name:
BDBM30762
Synonyms:
2-amino-N-butan-2-yl-1-(2-oxolanylmethyl)-3-pyrrolo[3,2-b]quinoxalinecarboxamide 2-amino-N-sec-butyl-1-(tetrahydrofurfuryl)pyrrolo[3,2-b]quinoxaline-3-carboxamide MLS000040979 cid_662288
Type:
Small organic molecule
Emp. Form.:
C20H25N5O2
Mol. Mass.:
367.4448
SMILES:
CCC(C)NC(=O)c1c(N)n(CC2CCCO2)c2nc3ccccc3nc12
: