Target
Caspase-9
Ligand
BDBM71274
Substrate
Meas. Tech.
Dose response confirmation of uHTS hits for Apaf-1 using a LZ-Caspase-9/Caspase-3 Fluorescent Selectivity assay
IC50
289±n/a nM
Citation
 PubChem, PC Dose response confirmation of uHTS hits for Apaf-1 using a LZ-Caspase-9/Caspase-3 Fluorescent Selectivity assay PubChem Bioassay (2011)[AID] 
Target
Name:
Caspase-9
Synonyms:
Apoptotic protease-activating factor 1/Caspase-3/Caspase-9/Cytochrome c CASP-9 CASP9_HUMAN ICE-like apoptotic protease 6 caspase-9 isoform alpha preproprotein
Type:
Enzyme
Mol. Mass.:
46277.29
Organism:
Homo sapiens (Human)
Description:
Residue:
416
  
Inhibitor
Name:
BDBM71274
Synonyms:
6-(3-acetylphenyl)-3-anilino-2H-isoquinolin-1-one 6-(3-ethanoylphenyl)-3-phenylazanyl-2H-isoquinolin-1-one SMR000472416 | cid_16727383
Type:
Small organic molecule
Emp. Form.:
C23H18N2O2
Mol. Mass.:
354.4012
SMILES:
CC(=O)c1cccc(c1)-c1ccc2c(cc(Nc3ccccc3)[nH]c2=O)c1
: