Target
Multidrug resistance protein CDR1
Ligand
BDBM84125
Substrate
Meas. Tech.
Dose Response HTS singleplex for inhibitors of yeast efflux pump, specifically Cdr1 with Hit compounds from Cherry Pick1
EC50
10700±n/a nM
Citation
 PubChem, PC Dose Response HTS singleplex for inhibitors of yeast efflux pump, specifically Cdr1 with Hit compounds from Cherry Pick1 PubChem Bioassay (2011)[AID] 
Target
Name:
Multidrug resistance protein CDR1
Synonyms:
CDR1 Multidrug resistance protein CDR1 | drug resistance protein 1
Type:
PROTEIN
Mol. Mass.:
169942.67
Organism:
Candida albicans
Description:
ChEMBL_708756
Residue:
1501
  
Inhibitor
Name:
BDBM84125
Synonyms:
1-[2-[4-[2-(3,5-dimethoxyphenyl)-5-methoxy-1-benzothiophen-3-yl]phenoxy]ethyl]piperidine MLS002603243 cid_44601952
Type:
Small organic molecule
Emp. Form.:
C30H33NO4S
Mol. Mass.:
503.652
SMILES:
COc1ccc2sc(c(-c3ccc(OCCN4CCCCC4)cc3)c2c1)-c1cc(OC)cc(OC)c1
: