Target
Fibroblast growth factor 1
Ligand
BDBM84561
Substrate
Meas. Tech.
Binding Assay
pH
7.4±0
Kd
20.7±1.3 nM
Citation
 Cochran, SLi, CPBytheway, I An experimental and molecular-modeling study of the binding of linked sulfated tetracyclitols to FGF-1 and FGF-2. Chembiochem 6:1882-90 (2005)  
Target
Name:
Fibroblast growth factor 1
Synonyms:
Acidic fibroblast growth factor ECGF-beta FGF1_HUMAN Fibroblast growth factor 1 (FGF-1) Heparin-binding growth factor 1 | aFGF
Type:
Protein
Mol. Mass.:
17461.01
Organism:
Homo sapiens (Human)
Description:
P05230
Residue:
155
  
Inhibitor
Name:
BDBM84561
Synonyms:
Linked sulfated tetracyclitol, 2
Type:
Small organic molecule
Emp. Form.:
C26H28N2O48S12
Mol. Mass.:
1521.272
SMILES:
[O-]S(=O)(=O)O[C@@H]1C=C[C@@H]([C@@H](OS([O-])(=O)=O)[C@@H]1OS([O-])(=O)=O)N(CCN([C@H]1C=C[C@@H](OS([O-])(=O)=O)[C@@H](OS([O-])(=O)=O)[C@@H]1OS([O-])(=O)=O)[C@H]1C=C[C@@H](OS([O-])(=O)=O)[C@@H](OS([O-])(=O)=O)[C@@H]1OS([O-])(=O)=O)[C@H]1C=C[C@@H](OS([O-])(=O)=O)[C@@H](OS([O-])(=O)=O)[C@@H]1OS([O-])(=O)=O
: