Target
Thymidylate synthase
Ligand
BDBM36703
Substrate
Meas. Tech.
Inhibition Assay
Ki
1.7e+4±n/a nM
Citation
 Calò, STondi, DFerrari, SVenturelli, AGhelli, SCosti, MP Constrained dansyl derivatives reveal bacterial specificity of highly conserved thymidylate synthases. Chembiochem 9:779-90 (2008)  
Target
Name:
Thymidylate synthase
Synonyms:
TSase Thymidylate Synthase (TS) thyA
Type:
Enzyme
Mol. Mass.:
36576.54
Organism:
Lactobacillus casei
Description:
Residue:
316
  
Inhibitor
Name:
BDBM36703
Synonyms:
Dansyl derivative, 7L | Dansyltyrosine deriviative 22B
Type:
Small organic molecule
Emp. Form.:
C32H28N2O6S
Mol. Mass.:
568.64
SMILES:
CN(C)c1cccc2c(cccc12)S(=O)(=O)Oc1ccc(C[C@H](NC(=O)c2ccc3ccccc3c2)C(O)=O)cc1
: