Target
Thymidylate synthase
Ligand
BDBM36701
Substrate
Meas. Tech.
Inhibition Assay
Ki
>1.327e+6±n/a nM
Citation
 Calò, STondi, DFerrari, SVenturelli, AGhelli, SCosti, MP Constrained dansyl derivatives reveal bacterial specificity of highly conserved thymidylate synthases. Chembiochem 9:779-90 (2008)  
Target
Name:
Thymidylate synthase
Synonyms:
TS TYSY_ECOLI thyA
Type:
Enzyme
Mol. Mass.:
30475.81
Organism:
Escherichia coli
Description:
Residue:
264
  
Inhibitor
Name:
BDBM36701
Synonyms:
Dansyl derivative, 3L | Dansyltyrosine deriviative 19B
Type:
Small organic molecule
Emp. Form.:
C27H25N3O9S2
Mol. Mass.:
599.632
SMILES:
CN(C)c1cccc2c(cccc12)S(=O)(=O)Oc1ccc(C[C@H](NS(=O)(=O)c2ccc(cc2)N(=O)=O)C(O)=O)cc1
: