Target
Somatostatin receptor type 1
Ligand
BDBM82458
Substrate
Ki
1000±n/a nM
Comments
PDSP_379
Citation
 Patel, YCSrikant, CB Subtype selectivity of peptide analogs for all five cloned human somatostatin receptors (hsstr 1-5). Endocrinology 135:2814-7 (1994)  
Target
Name:
Somatostatin receptor type 1
Synonyms:
SOMATOSTATIN SST1 SS-1-R SS1R SSTR1 | Somatostatin receptor type 1 (SSTR1)
Type:
Enzyme
Mol. Mass.:
42692.81
Organism:
Homo sapiens (Human)
Description:
P30872
Residue:
391
  
Inhibitor
Name:
BDBM82458
Synonyms:
BIM 23049 | D-Nal-Ala-Tyr-D-Trp-Lys-Val-Ala-Thr-NH2
Type:
Small organic molecule
Emp. Form.:
C52H68N10O9
Mol. Mass.:
977.1579
SMILES:
CC(C)[C@H](NC(=O)[C@H](CCCCN)NC(=O)[C@@H](Cc1c[nH]c2ccccc12)NC(=O)[C@H](Cc1ccc(O)cc1)NC(=O)[C@H](C)NCc1ccc2ccccc2c1)C(=O)N[C@@H](C)C(=O)N[C@@H]([C@@H](C)O)C(N)=O
: