Target
Somatostatin receptor type 1
Ligand
BDBM84619
Substrate
Ki
1000±n/a nM
Comments
PDSP_392
Citation
 Patel, YCSrikant, CB Subtype selectivity of peptide analogs for all five cloned human somatostatin receptors (hsstr 1-5). Endocrinology 135:2814-7 (1994)  
Target
Name:
Somatostatin receptor type 1
Synonyms:
SOMATOSTATIN SST1 SS-1-R SS1R SSTR1 | Somatostatin receptor type 1 (SSTR1)
Type:
Enzyme
Mol. Mass.:
42692.81
Organism:
Homo sapiens (Human)
Description:
P30872
Residue:
391
  
Inhibitor
Name:
BDBM84619
Synonyms:
BIM 23065 L-Threoninamide,3-(2-naphthalenyl)-D-alanyl-4-chloro-L-phenylalanyl-L-tyrosyl-D-tryptophyl-L-lysyl-L-threonyl-L-phenylalanyl-(9CI)
Type:
Small organic molecule
Emp. Form.:
C69H83ClN12O13
Mol. Mass.:
1323.923
SMILES:
C[C@@H](O)[C@H](NC(=O)[C@@H](Cc1ccccc1)NC(=O)[C@@H](NC(=O)[C@@H](NC(=O)[C@@H](CCCCN)NC(=O)[C@H](Cc1c[nH]c2ccccc12)NC(=O)C(Cc1ccc(O)cc1)NC(=O)[C@H](Cc1ccc(Cl)cc1)NC(=O)[C@H](N)Cc1ccc2ccccc2c1)C(C)O)C(C)O)C(N)=O
: