Target
Somatostatin receptor type 1
Ligand
BDBM84616
Substrate
Ki
1000±n/a nM
Comments
PDSP_396
Citation
 Raynor, KMurphy, WACoy, DHTaylor, JEMoreau, JPYasuda, KBell, GIReisine, T Cloned somatostatin receptors: identification of subtype-selective peptides and demonstration of high affinity binding of linear peptides. Mol Pharmacol 43:838-44 (1993) Target
Name:
Somatostatin receptor type 1
Synonyms:
SOMATOSTATIN SST1 SS-1-R SS1R SSTR1 | Somatostatin receptor type 1 (SSTR1)
Type:
Enzyme
Mol. Mass.:
42692.81
Organism:
Homo sapiens (Human)
Description:
P30872
Residue:
391
  
Inhibitor
Name:
BDBM84616
Synonyms:
BIM 23069 L-Alaninamide,4-chloro-D-phenylalanyl-L-alanyl-L-tyrosyl-D-tryptophyl-L-lysyl-L-valyl-L-alanyl-3-(2-naphthalenyl)-(9CI)
Type:
Emp. Form.:
C47H62ClN9O8
Mol. Mass.:
916.504
SMILES:
CC(C)[C@H](NC(=O)[C@H](CCCCN)NC(=O)[C@@H](Cc1c[nH]c2ccccc12)NC(=O)[C@H](Cc1ccc(O)cc1)NC(=O)[C@H](C)NC(=O)[C@H](N)Cc1ccc(Cl)cc1)C(=O)N[C@@H](C)C(C)=O
: