Target
Somatostatin receptor type 2
Ligand
BDBM81766
Substrate
Ki
0.18±n/a nM
Comments
PDSP_1242
Citation
 Raynor, KMurphy, WACoy, DHTaylor, JEMoreau, JPYasuda, KBell, GIReisine, T Cloned somatostatin receptors: identification of subtype-selective peptides and demonstration of high affinity binding of linear peptides. Mol Pharmacol 43:838-44 (1993) Target
Name:
Somatostatin receptor type 2
Synonyms:
SOMATOSTATIN SST2 Smstr2 Somatostatin receptor 2 Sst2 | Sstr2
Type:
Enzyme Catalytic Domain
Mol. Mass.:
41234.26
Organism:
MOUSE
Description:
SOMATOSTATIN SST2 SSTR2 MOUSE::P30875
Residue:
369
  
Inhibitor
Name:
BDBM81766
Synonyms:
CAS_3086456 NSC_3086456
Type:
Small organic molecule
Emp. Form.:
C44H56N8O7
Mol. Mass.:
808.9648
SMILES:
CC(C)C1NC(=O)C(CCCCN)NC(=O)C(Cc2c[nH]c3ccccc23)NC(=O)C(Cc2ccc(O)cc2)NC(=O)C(C)N(C)C(=O)C(Cc2ccccc2)NC1=O
: