Target
Somatostatin receptor type 3
Ligand
BDBM82461
Substrate
Ki
65±n/a nM
Comments
PDSP_398
Citation
 Raynor, KMurphy, WACoy, DHTaylor, JEMoreau, JPYasuda, KBell, GIReisine, T Cloned somatostatin receptors: identification of subtype-selective peptides and demonstration of high affinity binding of linear peptides. Mol Pharmacol 43:838-44 (1993) Target
Name:
Somatostatin receptor type 3
Synonyms:
SOMATOSTATIN SST3 SSR-28 Smstr3 Somatostatin receptor 3 Sstr3
Type:
Enzyme Catalytic Domain
Mol. Mass.:
47225.49
Organism:
MOUSE
Description:
SOMATOSTATIN SST3 SSTR3 MOUSE::P30935
Residue:
428
  
Inhibitor
Name:
BDBM82461
Synonyms:
BIM 23073 | D-Phe-AIa-Tyr-D-Trp-Lys-Val-Ala-D-Nal-NH2
Type:
Small organic molecule
Emp. Form.:
C59H73N11O9
Mol. Mass.:
1080.2792
SMILES:
CC(C)[C@H](NC(=O)[C@H](CCCCN)NC(=O)[C@@H](Cc1c[nH]c2ccccc12)NC(=O)[C@H](Cc1ccc(O)cc1)NC(=O)[C@H](C)NC(=O)[C@H](N)Cc1ccccc1)C(=O)N[C@@H](C)C(=O)N[C@H](Cc1ccc2ccccc2c1)C(N)=O
: