Target
Somatostatin receptor type 4
Ligand
BDBM84625
Substrate
Ki
53±n/a nM
Comments
PDSP_381
Citation
 Raynor, KO'Carroll, AMKong, HYasuda, KMahan, LCBell, GIReisine, T Characterization of cloned somatostatin receptors SSTR4 and SSTR5. Mol Pharmacol 44:385-92 (1993) Target
Name:
Somatostatin receptor type 4
Synonyms:
SOMATOSTATIN SST4 Somatostatin receptor Sstr4
Type:
Enzyme Catalytic Domain
Mol. Mass.:
42096.84
Organism:
RAT
Description:
SOMATOSTATIN SST4 SSTR4 RAT::P30937
Residue:
384
  
Inhibitor
Name:
BDBM84625
Synonyms:
BIM 23051
Type:
Small organic molecule
Emp. Form.:
C49H67N11O10
Mol. Mass.:
970.124
SMILES:
C[C@@H](O)[C@H](NC(=O)[C@H](C)NC(=O)[C@@H](NC(=O)[C@H](CCCCN)NC(=O)[C@@H](Cc1c[nH]c2ccccc12)NC(=O)[C@H](Cc1ccccc1)NC(=O)[C@H](C)NC(=O)[C@H](N)Cc1ccccc1)C(C)O)C(N)=O
: