Target
Somatostatin receptor type 4
Ligand
BDBM82468
Substrate
Ki
3.3±n/a nM
Comments
PDSP_384
Citation
 Raynor, KO'Carroll, AMKong, HYasuda, KMahan, LCBell, GIReisine, T Characterization of cloned somatostatin receptors SSTR4 and SSTR5. Mol Pharmacol 44:385-92 (1993) Target
Name:
Somatostatin receptor type 4
Synonyms:
SOMATOSTATIN SST4 Somatostatin receptor Sstr4
Type:
Enzyme Catalytic Domain
Mol. Mass.:
42096.84
Organism:
RAT
Description:
SOMATOSTATIN SST4 SSTR4 RAT::P30937
Residue:
384
  
Inhibitor
Name:
BDBM82468
Synonyms:
BIM 23055 | D-Phe-Phe-Tyr-D-Trp-Lys-Val-Phe-D-Phe-NH2
Type:
Small organic molecule
Emp. Form.:
C67H79N11O9
Mol. Mass.:
1182.4125
SMILES:
CC(C)[C@H](NC(=O)[C@H](CCCCN)NC(=O)[C@@H](Cc1c[nH]c2ccccc12)NC(=O)[C@H](Cc1ccc(O)cc1)NC(=O)[C@H](Cc1ccccc1)NC(=O)[C@H](N)Cc1ccccc1)C(=O)N[C@@H](Cc1ccccc1)C(=O)N[C@H](Cc1ccccc1)C(N)=O
: