Target
Somatostatin receptor type 4
Ligand
BDBM84638
Substrate
Ki
10±n/a nM
Comments
PDSP_397
Citation
 Raynor, KO'Carroll, AMKong, HYasuda, KMahan, LCBell, GIReisine, T Characterization of cloned somatostatin receptors SSTR4 and SSTR5. Mol Pharmacol 44:385-92 (1993) Target
Name:
Somatostatin receptor type 4
Synonyms:
SOMATOSTATIN SST4 Somatostatin receptor Sstr4
Type:
Enzyme Catalytic Domain
Mol. Mass.:
42096.84
Organism:
RAT
Description:
SOMATOSTATIN SST4 SSTR4 RAT::P30937
Residue:
384
  
Inhibitor
Name:
BDBM84638
Synonyms:
BIM 23070
Type:
Small organic molecule
Emp. Form.:
C58H71N11O10
Mol. Mass.:
1082.252
SMILES:
CC(O)[C@H](NC(=O)[C@H](CCCCN)NC(=O)[C@@H](Cc1c[nH]c2ccccc12)NC(=O)[C@H](Cc1ccc(O)cc1)NC(=O)[C@H](C)NC(=O)[C@H](N)Cc1ccccc1)C(=O)N[C@@H](C)C(=O)N[C@@H](Cc1cccc2ccccc12)C(N)=O
: