Target
Somatostatin receptor type 4
Ligand
BDBM84642
Substrate
Ki
34±n/a nM
Comments
PDSP_997
Citation
 Raynor, KO'Carroll, AMKong, HYasuda, KMahan, LCBell, GIReisine, T Characterization of cloned somatostatin receptors SSTR4 and SSTR5. Mol Pharmacol 44:385-92 (1993) Target
Name:
Somatostatin receptor type 4
Synonyms:
SOMATOSTATIN SST4 Somatostatin receptor Sstr4
Type:
Enzyme Catalytic Domain
Mol. Mass.:
42096.84
Organism:
RAT
Description:
SOMATOSTATIN SST4 SSTR4 RAT::P30937
Residue:
384
  
Inhibitor
Name:
BDBM84642
Synonyms:
SA IV | c[Ahx-Phe-D-Trp-Lys-Thr(Bzl)]
Type:
Small organic molecule
Emp. Form.:
C44H58N8O6
Mol. Mass.:
794.9813
SMILES:
CC(OCc1ccccc1)C1NC(=O)C(CCCCCCN)NC(=O)C(Cc2ccccc2)NC(=O)C(Cc2c[nH]c3ccccc23)NC(=O)C(CCCN)NC1=O
: