Target
Somatostatin receptor type 4
Ligand
BDBM82466
Substrate
Ki
0.47±n/a nM
Comments
PDSP_1034
Citation
 Raynor, KO'Carroll, AMKong, HYasuda, KMahan, LCBell, GIReisine, T Characterization of cloned somatostatin receptors SSTR4 and SSTR5. Mol Pharmacol 44:385-92 (1993) Target
Name:
Somatostatin receptor type 4
Synonyms:
SOMATOSTATIN SST4 Somatostatin receptor Sstr4
Type:
Enzyme Catalytic Domain
Mol. Mass.:
42096.84
Organism:
RAT
Description:
SOMATOSTATIN SST4 SSTR4 RAT::P30937
Residue:
384
  
Inhibitor
Name:
BDBM82466
Synonyms:
L-362,862 c[Aha-Phe-p-C1-Phe-D-Trp-Lys-Thr-Phe]
Type:
Small organic molecule
Emp. Form.:
C55H68ClN9O8
Mol. Mass.:
1018.637
SMILES:
C[C@@H](O)[C@@H]1NC(=O)[C@H](CCCCN)NC(=O)[C@@H](Cc2c[nH]c3ccccc23)NC(=O)[C@H](Cc2ccccc2)NC(=O)[C@H](Cc2ccc(Cl)cc2)NC(=O)CCCCCCNC(=O)[C@H](Cc2ccccc2)NC1=O
: