Target
Somatostatin receptor type 5
Ligand
BDBM84619
Substrate
Ki
433±n/a nM
Comments
PDSP_392
Citation
 Raynor, KO'Carroll, AMKong, HYasuda, KMahan, LCBell, GIReisine, T Characterization of cloned somatostatin receptors SSTR4 and SSTR5. Mol Pharmacol 44:385-92 (1993) Target
Name:
Somatostatin receptor type 5
Synonyms:
SOMATOSTATIN SST5 SS5-R SSR5_HUMAN Somatostatin receptor type 5 (SSTR5)
Type:
Enzyme
Mol. Mass.:
39218.02
Organism:
Homo sapiens (Human)
Description:
P35346
Residue:
364
  
Inhibitor
Name:
BDBM84619
Synonyms:
BIM 23065 L-Threoninamide,3-(2-naphthalenyl)-D-alanyl-4-chloro-L-phenylalanyl-L-tyrosyl-D-tryptophyl-L-lysyl-L-threonyl-L-phenylalanyl-(9CI)
Type:
Small organic molecule
Emp. Form.:
C69H83ClN12O13
Mol. Mass.:
1323.923
SMILES:
C[C@@H](O)[C@H](NC(=O)[C@@H](Cc1ccccc1)NC(=O)[C@@H](NC(=O)[C@@H](NC(=O)[C@@H](CCCCN)NC(=O)[C@H](Cc1c[nH]c2ccccc12)NC(=O)C(Cc1ccc(O)cc1)NC(=O)[C@H](Cc1ccc(Cl)cc1)NC(=O)[C@H](N)Cc1ccc2ccccc2c1)C(C)O)C(C)O)C(N)=O
: