Target
Somatostatin receptor type 5
Ligand
BDBM84616
Substrate
Ki
1000±n/a nM
Comments
PDSP_396
Citation
 Raynor, KO'Carroll, AMKong, HYasuda, KMahan, LCBell, GIReisine, T Characterization of cloned somatostatin receptors SSTR4 and SSTR5. Mol Pharmacol 44:385-92 (1993) Target
Name:
Somatostatin receptor type 5
Synonyms:
SOMATOSTATIN SST5 SS5-R SSR5_HUMAN Somatostatin receptor type 5 (SSTR5)
Type:
Enzyme
Mol. Mass.:
39218.02
Organism:
Homo sapiens (Human)
Description:
P35346
Residue:
364
  
Inhibitor
Name:
BDBM84616
Synonyms:
BIM 23069 L-Alaninamide,4-chloro-D-phenylalanyl-L-alanyl-L-tyrosyl-D-tryptophyl-L-lysyl-L-valyl-L-alanyl-3-(2-naphthalenyl)-(9CI)
Type:
Emp. Form.:
C47H62ClN9O8
Mol. Mass.:
916.504
SMILES:
CC(C)[C@H](NC(=O)[C@H](CCCCN)NC(=O)[C@@H](Cc1c[nH]c2ccccc12)NC(=O)[C@H](Cc1ccc(O)cc1)NC(=O)[C@H](C)NC(=O)[C@H](N)Cc1ccc(Cl)cc1)C(=O)N[C@@H](C)C(C)=O
: