Target
Sodium-dependent dopamine transporter
Ligand
BDBM50005246
Substrate
Ki
>10000±n/a nM
Comments
PDSP_296
Citation
 Pristupa, ZBWilson, JMHoffman, BJKish, SJNiznik, HB Pharmacological heterogeneity of the cloned and native human dopamine transporter: disassociation of [3H]WIN 35,428 and [3H]GBR 12,935 binding. Mol Pharmacol 45:125-35 (1994) Target
Name:
Sodium-dependent dopamine transporter
Synonyms:
DA transporter DAT1 Dopamine transporter protein (DAT) SC6A3_HUMAN Sodium-dependent dopamine transporter Solute carrier family 6 member 3
Type:
Multi-pass membrane protein
Mol. Mass.:
68497.11
Organism:
Homo sapiens (Human)
Description:
Q01959
Residue:
620
  
Inhibitor
Name:
BDBM50005246
Synonyms:
1-Phenylpropan-2-amin 1-phenylpropan-2-amine AMPHETAMINE Amfetamine DEXTROAMP SACCHARATE alpha-methylphenylethylamine beta-Phenylisopropylamin beta-phenylisopropylamine | desoxynorephedrine
Type:
Small organic molecule
Emp. Form.:
C9H13N
Mol. Mass.:
135.2062
SMILES:
CC(N)Cc1ccccc1
: